Target
Glucagon receptor
Ligand
BDBM50280717
Substrate
Meas. Tech.
ChEBML_219265
IC50
4000±n/a nM
Citation
 Collins, JLDambek, PJGoldstein, SWFaraci, W CP-99,711: a non-peptide glucagon receptor antagonist Bioorg Med Chem Lett 2:915-918 (1992)    Article 
Target
Name:
Glucagon receptor
Synonyms:
GL-R Gcgr
Type:
PROTEIN
Mol. Mass.:
55053.40
Organism:
Rattus norvegicus
Description:
ChEMBL_1450588
Residue:
485
  
Inhibitor
Name:
BDBM50280717
Synonyms:
CHEMBL557974 N-[6,7-Dichloro-3-((E)-styryl)-quinoxalin-2-yl]-N,N',N'-trimethyl-propane-1,3-diamine; hydrochloride
Type:
Small organic molecule
Emp. Form.:
C22H24Cl2N4
Mol. Mass.:
415.359
SMILES:
CN(C)CCCN(C)c1nc2cc(Cl)c(Cl)cc2nc1\C=C\c1ccccc1
: