Target
Acetylcholinesterase
Ligand
BDBM50281123
Substrate
Meas. Tech.
ChEBML_27804
Ki
0.390000±n/a nM
Citation
 Nair, HKQuinn, DM m-Alkyl, α,α,α-trifluoroacetophenones: A new class of potent transition state analog inhibitors of acetylcholinesterase Bioorg Med Chem Lett 3:2619-2622 (1993)    Article 
Target
Name:
Acetylcholinesterase
Synonyms:
3.1.1.7 Acetylcholinesterase (AChE) ache
Type:
Mol. Mass.:
65900.74
Organism:
Tetronarce californica (Pacific electric ray) (Torpedo californica)
Description:
P04058
Residue:
586
  
Inhibitor
Name:
BDBM50281123
Synonyms:
2,2,2-Trifluoro-1-(3-trifluoromethyl-phenyl)-ethanone | CHEMBL86546
Type:
Small organic molecule
Emp. Form.:
C9H4F6O
Mol. Mass.:
242.1179
SMILES:
FC(F)(F)C(=O)c1cccc(c1)C(F)(F)F
: