Target
Adenosine receptor A1
Ligand
BDBM50281142
Substrate
Meas. Tech.
ChEBML_29639
Ki
9.9±n/a nM
Citation
 Knutsen, LJLau, JSheardown, MJThomsen, C The synthesis and biochemical evaluation of new A1 selective adenosine receptor agonists containing 6-hydrazinopurine moieties Bioorg Med Chem Lett 3:2661-2666 (1993)    Article 
Target
Name:
Adenosine receptor A1
Synonyms:
AA1R_RAT ADENOSINE A1 high Adenosine A1 receptor (A1) Adenosine receptors A1 | Adora1
Type:
Protein
Mol. Mass.:
36704.13
Organism:
Rattus norvegicus (rat)
Description:
Residue:
326
  
Inhibitor
Name:
BDBM50281142
Synonyms:
(2R,3R,4S,5R)-2-[2-Chloro-6-((S)-2-methoxymethyl-pyrrolidin-1-ylamino)-purin-9-yl]-5-hydroxymethyl-tetrahydro-furan-3,4-diol | CHEMBL328097
Type:
Small organic molecule
Emp. Form.:
C16H23ClN6O5
Mol. Mass.:
414.844
SMILES:
COC[C@@H]1CCCN1Nc1nc(Cl)nc2n(cnc12)[C@@H]1O[C@H](CO)[C@@H](O)[C@H]1O
: