Target
Adenosine receptor A1
Ligand
BDBM50281143
Substrate
Meas. Tech.
ChEBML_29639
Ki
4±n/a nM
Citation
 Knutsen, LJLau, JSheardown, MJThomsen, C The synthesis and biochemical evaluation of new A1 selective adenosine receptor agonists containing 6-hydrazinopurine moieties Bioorg Med Chem Lett 3:2661-2666 (1993)    Article 
Target
Name:
Adenosine receptor A1
Synonyms:
AA1R_RAT ADENOSINE A1 high Adenosine A1 receptor (A1) Adenosine receptors A1 | Adora1
Type:
Protein
Mol. Mass.:
36704.13
Organism:
Rattus norvegicus (rat)
Description:
Residue:
326
  
Inhibitor
Name:
BDBM50281143
Synonyms:
(2R,3R,4S,5R)-2-[2-Chloro-6-(2,6-dimethyl-piperidin-1-ylamino)-purin-9-yl]-5-hydroxymethyl-tetrahydro-furan-3,4-diol | CHEMBL430459
Type:
Small organic molecule
Emp. Form.:
C17H25ClN6O4
Mol. Mass.:
412.871
SMILES:
CC1CCCC(C)N1Nc1nc(Cl)nc2n(cnc12)[C@@H]1O[C@H](CO)[C@@H](O)[C@H]1O
: