Target
Voltage-dependent L-type calcium channel subunit alpha-1S
Ligand
BDBM50281272
Substrate
Meas. Tech.
ChEBML_42767
Ki
85±n/a nM
Citation
 Atwal, KSAhmed, SZFloyd, DMMoreland, SHedberg, A (cis)-3-methyl-1,5-benzothiazepine-4-ones: potent analogs of the calcium channel blocker diltiazen Bioorg Med Chem Lett 3:2797-2800 (1993)    Article 
Target
Name:
Voltage-dependent L-type calcium channel subunit alpha-1S
Synonyms:
CAC1S_HUMAN CACN1 CACNL1A3 Voltage-dependent L-type calcium channel subunit alpha-1S Voltage-gated L-type calcium channel alpha-1S subunit Voltage-gated calcium channel subunit alpha Cav1.1
Type:
PROTEIN
Mol. Mass.:
212348.33
Organism:
Homo sapiens (Human)
Description:
ChEMBL_42767
Residue:
1873
  
Inhibitor
Name:
BDBM50281272
Synonyms:
(2R,3S)-5-(2-Dimethylamino-ethyl)-8-methoxy-2-(4-methoxy-phenyl)-3-methyl-2,3-dihydro-5H-benzo[b][1,4]thiazepin-4-one | CHEMBL96454
Type:
Small organic molecule
Emp. Form.:
C22H28N2O3S
Mol. Mass.:
400.534
SMILES:
COc1ccc(cc1)[C@@H]1Sc2cc(OC)ccc2N(CCN(C)C)C(=O)[C@@H]1C
: