Target
Cholecystokinin receptor type A
Ligand
BDBM50449746
Substrate
Meas. Tech.
ChEBML_50048
IC50
1846±n/a nM
Citation
 Padia, JKBolton, GLHill, DHorell, DCRoth, BDTrivedi, BK Synthesis and sar study of novel CCK-B antagonists Bioorg Med Chem Lett 3:2805-2810 (1993)    Article 
Target
Name:
Cholecystokinin receptor type A
Synonyms:
CCKAR_RAT Cholecystokinin peripheral Cholecystokinin receptor type A
Type:
Enzyme Catalytic Domain
Mol. Mass.:
49676.37
Organism:
RAT
Description:
Cholecystokinin central 0 RAT::P30551
Residue:
444
  
Inhibitor
Name:
BDBM50449746
Synonyms:
CHEMBL2304063
Type:
Small organic molecule
Emp. Form.:
C30H36N4O3
Mol. Mass.:
500.6318
SMILES:
[H][C@@]12C[C@@]3([H])C[C@@]([H])(C1)C(OC(=O)N[C@@](C)(Cc1c[nH]c4ccccc14)C(=O)NCCc1ccccn1)[C@@]([H])(C2)C3
: