Target
Sigma non-opioid intracellular receptor 1
Ligand
BDBM50281500
Substrate
Meas. Tech.
ChEBML_201269
Ki
1.04±n/a nM
Citation
 Wustrow, DJWise, LDPugsley, TAMeltzer, LTHeffner, TG 4-Aryltetrahydropyridines as selective σ ligands Bioorg Med Chem Lett 3:277-280 (1993)    Article 
Target
Name:
Sigma non-opioid intracellular receptor 1
Synonyms:
Aging-associated gene 8 protein SGMR1_HUMAN SIGMAR1 SR31747-binding protein Sigma 1-type opioid receptor Sigma1R | hSigmaR1
Type:
Enzyme Catalytic Domain
Mol. Mass.:
25124.85
Organism:
Homo sapiens (Human)
Description:
Q99720
Residue:
223
  
Inhibitor
Name:
BDBM50281500
Synonyms:
4-{4-[4-(4-Chloro-phenyl)-3,6-dihydro-2H-pyridin-1-yl]-butyl}-pyridine | CHEMBL93442
Type:
Small organic molecule
Emp. Form.:
C20H23ClN2
Mol. Mass.:
326.863
SMILES:
Clc1ccc(cc1)C1=CCN(CCCCc2ccncc2)CC1
: