Target
Endothelin-1 receptor
Ligand
BDBM50001217
Substrate
Meas. Tech.
ChEBML_63191
IC50
>10000±n/a nM
Citation
 Doherty, AMCody, WLHe, JXDePue, PLLeonard, DMJr., JDHill, KEFlynn, MAReynolds, EE Design of C-terminal peptide antagonists of endothelin: structure-activity relationships of ET-[16–21, D-His16Bioorg Med Chem Lett 3:497-502 (1993)    Article 
Target
Name:
Endothelin-1 receptor
Synonyms:
EDNRA ET-A ETA-R Endothelin receptor type A hET-AR
Type:
Enzyme Catalytic Domain
Mol. Mass.:
48736.88
Organism:
Homo sapiens (Human)
Description:
P25101
Residue:
427
  
Inhibitor
Name:
BDBM50001217
Synonyms:
3-[2-(2-Acetylamino-3-phenyl-propionylamino)-4-methyl-pentanoylamino]-N-(1-{1-[1-carboxy-2-(1H-indol-3-yl)-ethylcarbamoyl]-2-methyl-butylcarbamoyl}-2-methyl-butyl)-succinamic acid | CHEMBL86814
Type:
Small organic molecule
Emp. Form.:
C44H61N7O10
Mol. Mass.:
847.996
SMILES:
CC[C@H](C)[C@H](NC(=O)[C@H](CC(O)=O)NC(=O)[C@H](CC(C)C)NC(=O)[C@@H](Cc1ccccc1)NC(C)=O)C(=O)N[C@@H]([C@@H](C)CC)C(=O)N[C@@H](Cc1c[nH]c2ccccc12)C(O)=O
: