Target
Gamma-aminobutyric acid type B receptor subunit 1/2
Ligand
BDBM50033003
Substrate
Meas. Tech.
ChEMBL_68556 (CHEMBL679643)
IC50
2500±n/a nM
Citation
 Howson, WMistry, JBroekman, mHills, JM Biological activity of 3-aminopropyl (methyl) phosphinic acid, a potent and selective GABAB agonist with CNS activity Bioorg Med Chem Lett 3:515-518 (1993)    Article 
Target
Name:
Gamma-aminobutyric acid type B receptor subunit 1/2
Synonyms:
GABA B receptor | GABA-B receptor 1/2
Type:
Mol. Mass.:
Description:
ASSAY_ID of EBI is 68556
Components:
This complex has 2 components.
Component 1
Name:
Gamma-aminobutyric acid type B receptor subunit 1
Synonyms:
GABA B GABA uptake GABA-B-R1 GABABR1 Gabbr1 | Gb1
Type:
Enzyme Catalytic Domain
Mol. Mass.:
111548.69
Organism:
Rattus norvegicus (Rat)
Description:
Q9Z0U4
Residue:
991
  
Component 2
Name:
Gamma-aminobutyric acid type B receptor subunit 2
Synonyms:
GABA B receptor Gabbr2 | Gpr51
Type:
PROTEIN
Mol. Mass.:
105775.46
Organism:
Rattus norvegicus
Description:
O88871
Residue:
940
  
Inhibitor
Name:
BDBM50033003
Synonyms:
(3-Amino-propyl)-diethoxymethyl-phosphinic acid CHEMBL40157
Type:
Small organic molecule
Emp. Form.:
C8H20NO4P
Mol. Mass.:
225.2225
SMILES:
CCOC(OCC)P(O)(=O)CCCN
: