Target
Neutrophil elastase
Ligand
BDBM50004187
Substrate
Meas. Tech.
ChEBML_63656
IC50
365±n/a nM
Citation
 Skiles, JWSorcek, RJacober, SMiao, CMui, PWMcNeil, DRosenthal, AS elastase inhibitors containing conformationally restricted lactams as P3-P2 dipeptide replacements Bioorg Med Chem Lett 3:773-778 (1993)    Article 
Target
Name:
Neutrophil elastase
Synonyms:
Bone marrow serine protease Coagulation factor X ELANE Elastase HLE Leukocyte elastase Medullasin Neutrophil elastase (HNE) PMN elastase Trypsin
Type:
Enzyme
Mol. Mass.:
28532.38
Organism:
Homo sapiens (Human)
Description:
P08246
Residue:
267
  
Inhibitor
Name:
BDBM50004187
Synonyms:
((S)-1-{Indan-2-yl-[(3,3,3-trifluoro-1-isopropyl-2-oxo-propylcarbamoyl)-methyl]-carbamoyl}-2-methyl-propyl)-carbamic acid benzyl ester CHEMBL264180
Type:
Small organic molecule
Emp. Form.:
C30H36F3N3O5
Mol. Mass.:
575.6191
SMILES:
CC(C)[C@H](NC(=O)OCc1ccccc1)C(=O)N(CC(=O)NC(C(C)C)C(=O)C(F)(F)F)C1Cc2ccccc2C1
: