Target
Gastrin/cholecystokinin type B receptor
Ligand
BDBM50281664
Substrate
Meas. Tech.
ChEBML_48092
Ki
0.060000±n/a nM
Citation
 Roques, BPCorringer, PJDerrien, MDaugé, VDurieux, C Structure-based design and pharmacological properties of potent selective and systemically active CCK-B peptidomimetics Bioorg Med Chem Lett 3:847-850 (1993)    Article 
Target
Name:
Gastrin/cholecystokinin type B receptor
Synonyms:
CCK-2 receptor CCK-BR CCKRB Cholecystokinin receptor GASR_HUMAN | Gastrin/cholecystokinin type B receptor
Type:
G Protein-Coupled Receptor (GPCR)
Mol. Mass.:
48445.79
Organism:
Homo sapiens (Human)
Description:
Stable expression of human CCK-2 receptors in HEK 293 cells.
Residue:
447
  
Inhibitor
Name:
BDBM50281664
Synonyms:
CHEMBL262894 | p-Tyr(SO3Na)-gNle-mGly-Trp-(N-Me)Nle-Asp-Phe-NH2
Type:
Small organic molecule
Emp. Form.:
C47H60N9O13S
Mol. Mass.:
991.097
SMILES:
CCCC[C@H](NC(=O)[C@@H](N)Cc1ccc(OS([O-])(=O)=O)cc1)C(=O)NCC(=O)N[C@@H](Cc1c[nH]c2ccccc12)C(=O)N[C@@H](CCCC)C(=O)N[C@@H](CC(O)=O)C(=O)N[C@@H](Cc1ccccc1)C(N)=O
: