Target
Lanosterol synthase
Ligand
BDBM50281886
Substrate
Meas. Tech.
ChEBML_148884
IC50
5000±n/a nM
Citation
 Wannamaker, MWaid, PPMoore, WRSchatzman, GLVan Sickle, WAWilson, PK Inhibition of 2,3-oxidosqualene cyclase by N-alkylpiperidines Bioorg Med Chem Lett 3:1175-1178 (1993)    Article 
Target
Name:
Lanosterol synthase
Synonyms:
LSS_RAT Osc
Type:
PROTEIN
Mol. Mass.:
83302.12
Organism:
Rattus norvegicus
Description:
ChEMBL_12083
Residue:
733
  
Inhibitor
Name:
BDBM50281886
Synonyms:
1-(1,5,9-Trimethyl-decyl)-piperidin-3-ol | CHEMBL17219
Type:
Small organic molecule
Emp. Form.:
C18H37NO
Mol. Mass.:
283.4925
SMILES:
CC(C)CCCC(C)CCCC(C)N1CCCC(O)C1
: