Target
Lanosterol synthase
Ligand
BDBM50003032
Substrate
Meas. Tech.
ChEBML_148884
IC50
550±n/a nM
Citation
 Wannamaker, MWaid, PPMoore, WRSchatzman, GLVan Sickle, WAWilson, PK Inhibition of 2,3-oxidosqualene cyclase by N-alkylpiperidines Bioorg Med Chem Lett 3:1175-1178 (1993)    Article 
Target
Name:
Lanosterol synthase
Synonyms:
LSS_RAT Osc
Type:
PROTEIN
Mol. Mass.:
83302.12
Organism:
Rattus norvegicus
Description:
ChEMBL_12083
Residue:
733
  
Inhibitor
Name:
BDBM50003032
Synonyms:
(4aS,5S,6S,8aS)-2-Dodecyl-5,8a-dimethyl-decahydro-isoquinolin-6-ol CHEMBL279569
Type:
Small organic molecule
Emp. Form.:
C23H45NO
Mol. Mass.:
351.6095
SMILES:
CCCCCCCCCCCCN1CC[C@H]2[C@H](C)[C@@H](O)CC[C@]2(C)C1
: