Target
Type-2 angiotensin II receptor
Ligand
BDBM50009718
Substrate
Meas. Tech.
ChEMBL_35438 (CHEMBL643798)
IC50
>10000±n/a nM
Citation
 Mantlo, NBKim, DOndeyka, DChang, RSKivlighn, SDSiegl, PKGreenlee, WJ Imidazo[4,5-b]pyridine-based AT1 / AT2 angiotensin II receptor antagonists Bioorg Med Chem Lett 4:17-22 (1994)    Article 
Target
Name:
Type-2 angiotensin II receptor
Synonyms:
AGTR2_RAT Agtr2 Angiotensin II receptor Type-2 angiotensin II receptor
Type:
Enzyme Catalytic Domain
Mol. Mass.:
41346.62
Organism:
RAT
Description:
Angiotensin II AT2 0 0::P35351
Residue:
363
  
Inhibitor
Name:
BDBM50009718
Synonyms:
2-Ethyl-5,7-dimethyl-3-[2'-(1H-tetrazol-5-yl)-biphenyl-4-ylmethyl]-3H-imidazo[4,5-b]pyridine 2-Ethyl-5,7-dimethyl-3-[2'-(1H-tetrazol-5-yl)-biphenyl-4-ylmethyl]-3H-imidazo[4,5-b]pyridine (L158809) 2-Ethyl-5,7-dimethyl-3-[2'-(2H-tetrazol-5-yl)-biphenyl-4-ylmethyl]-3H-imidazo[4,5-b]pyridine(L-158809) CHEMBL7550 | L-158809
Type:
Small organic molecule
Emp. Form.:
C24H23N7
Mol. Mass.:
409.4863
SMILES:
CCc1nc2c(C)cc(C)nc2n1Cc1ccc(cc1)-c1ccccc1-c1nnn[nH]1
: