Target
Type-2 angiotensin II receptor
Ligand
BDBM50282404
Substrate
Meas. Tech.
ChEMBL_35431 (CHEMBL643791)
IC50
1.1±n/a nM
Citation
 Klutchko, SHamby, JMHodges, JC Tetrahydroisoquinoline derivatives with AT2-specific angiotensin II reception binding inhibitory activity Bioorg Med Chem Lett 4:57-62 (1994)    Article 
Target
Name:
Type-2 angiotensin II receptor
Synonyms:
AGTR2 AT2 Angiotensin II type 2 (AT-2) receptor Type-2 angiotensin II receptor
Type:
Enzyme Catalytic Domain
Mol. Mass.:
41201.61
Organism:
Homo sapiens (Human)
Description:
Angiotensin II, central 0 0::P50052
Residue:
363
  
Inhibitor
Name:
BDBM50282404
Synonyms:
5-Benzyloxy-2-(2-cyclopentyl-2-phenyl-acetyl)-6-methoxy-1,2,3,4-tetrahydro-isoquinoline-3-carboxylic acid | CHEMBL154057
Type:
Small organic molecule
Emp. Form.:
C31H33NO5
Mol. Mass.:
499.5974
SMILES:
COc1ccc2CN(C(Cc2c1OCc1ccccc1)C(O)=O)C(=O)C(C1CCCC1)c1ccccc1
: