Target
Stromelysin-1
Ligand
BDBM50282539
Substrate
Meas. Tech.
ChEMBL_205642 (CHEMBL813250)
Ki
20±n/a nM
Citation
 Goulet, JLKinneary, JFDurette, PLStein, RLHarrison, RKIzquierdo-Martin, MKuo, DWLin, TYHagmann, WK Inhibition of stromelysin-1 (MMP-3) by peptidyl phosphinic acids Bioorg Med Chem Lett 4:1221-1224 (1994)    Article 
Target
Name:
Stromelysin-1
Synonyms:
MMP-3 MMP3_HUMAN Matrix metalloproteinase 3 Matrix metalloproteinase-3 (MMP-3) SL-1 Stromelysin 1 | Transin-1
Type:
Enzyme
Mol. Mass.:
53973.13
Organism:
Homo sapiens (Human)
Description:
P08254
Residue:
477
  
Inhibitor
Name:
BDBM50282539
Synonyms:
((R)-1-{(S)-2-[(1-Benzoyl-pyrrolidine-2-carbonyl)-amino]-propionylamino}-ethyl)-[2-((S)-3-methyl-1-phenylcarbamoyl-butylcarbamoyl)-4-phenyl-butyl]-phosphinic acid | CHEMBL281409
Type:
Small organic molecule
Emp. Form.:
C40H52N5O7P
Mol. Mass.:
745.8439
SMILES:
CC(C)C[C@H](NC(=O)C(CCc1ccccc1)CP(O)(=O)[C@H](C)NC(=O)[C@H](C)NC(=O)C1CCCN1C(=O)c1ccccc1)C(=O)Nc1ccccc1
: