Target
Renin
Ligand
BDBM50282596
Substrate
Meas. Tech.
ChEMBL_195791 (CHEMBL801712)
IC50
55±n/a nM
Citation
 Smith, SAAl-Barazanji, KABuckingham, RECassidy, FColdwell, MCFinney, FJHadley, MSHam, PLawrence, SANash, DJTingley, EJWatson, JM The identification of a novel renin inhibitor of equivalent efficacy following oral or intravenous administration. Bioorg Med Chem Lett 4:1291-1296 (1994)    Article 
Target
Name:
Renin
Synonyms:
Angiotensinogenase RENI_HUMAN
Type:
Enzyme
Mol. Mass.:
45058.99
Organism:
Homo sapiens (Human)
Description:
Residue:
406
  
Inhibitor
Name:
BDBM50282596
Synonyms:
4-[(3S,4S)-5-Cyclohexyl-4-((S)-2-{(S)-2-[2-(1,1-dioxo-2,3-dihydro-1H-1lambda*6*-benzo[b]thiophen-3-yl)-acetylamino]-3-phenyl-propionylamino}-4-methyl-pentanoylamino)-3-hydroxy-pentanoylamino]-butyric acid | CHEMBL291240
Type:
Small organic molecule
Emp. Form.:
C40H56N4O9S
Mol. Mass.:
768.959
SMILES:
CC(C)C[C@H](NC(=O)[C@H](Cc1ccccc1)NC(=O)CC1CS(=O)(=O)c2ccccc12)C(=O)N[C@@H](CC1CCCCC1)[C@@H](O)CC(=O)NCCCC(O)=O
: