Target
5-hydroxytryptamine receptor 3A/3B
Ligand
BDBM29526
Substrate
Meas. Tech.
ChEMBL_2976 (CHEMBL620623)
Ki
782±n/a nM
Citation
 Langlois, MZhang, LBre´mont, BShen, SManara, LCroci, T Design of a potent 5-HT4 receptor agonist with nanomolar affinity Bioorg Med Chem Lett 4:1433-1436 (1994)    Article 
Target
Name:
5-hydroxytryptamine receptor 3A/3B
Synonyms:
Serotonin 3 (5-HT3) receptor | Serotonin 3a (5-HT3a)/3b (5-HT3b) receptor
Type:
Mol. Mass.:
Description:
ASSAY_ID of EBI is 2974
Components:
This complex has 2 components.
Component 1
Name:
5-hydroxytryptamine receptor 3B
Synonyms:
5HT3B_RAT Serotonin (5-HT) receptor
Type:
PROTEIN
Mol. Mass.:
50328.78
Organism:
Rattus norvegicus
Description:
EBI_11885
Residue:
437
  
Component 2
Name:
5-hydroxytryptamine receptor 3A
Synonyms:
5-HT3 5HT3A_RAT Htr3 Serotonin (5-HT) receptor | Zacopride site-R
Type:
Enzyme Catalytic Domain
Mol. Mass.:
55428.70
Organism:
RAT
Description:
5-HT3 HTR3A RAT::P35563
Residue:
483
  
Inhibitor
Name:
BDBM29526
Synonyms:
2-Piperidinoethyl 4-amino-5-chloro-2-methoxybenzoate ML 10302 | ML10302
Type:
Small organic molecule
Emp. Form.:
C15H21ClN2O3
Mol. Mass.:
312.792
SMILES:
COc1cc(N)c(Cl)cc1C(=O)OCCN1CCCCC1
: