Target
Type-1 angiotensin II receptor A/B
Ligand
BDBM50031491
Substrate
Meas. Tech.
ChEMBL_34956 (CHEMBL647799)
IC50
0.300000±n/a nM
Citation
 Quan, MLOlson, RECarini, DJEllis, CDHillyer, GLLalka, GKLiu, JVanAtten, MKChiu, ATWong, PCWexler, RRTimmermans, PB Balanced angiotensin II receptor antagonists. I. The effects of biphenyl “ortho”-substitution on AT1/AT2 affinities Bioorg Med Chem Lett 4:2011-2016 (1994)    Article 
Target
Name:
Type-1 angiotensin II receptor A/B
Synonyms:
Angiotensin II receptor (AT-1) type-1 | Type-1A/Type-1B angiotensin II receptor
Type:
Mol. Mass.:
Description:
ASSAY_ID of ChEMBL is 901964
Components:
This complex has 2 components.
Component 1
Name:
Type-1 angiotensin II receptor B
Synonyms:
AGTRB_RAT Agtr1 Angiotensin II AT1B Angiotensin II type 1b (AT-1b) receptor Type-1B angiotensin II receptor
Type:
Enzyme Catalytic Domain
Mol. Mass.:
40929.44
Organism:
RAT
Description:
Angiotensin II AT1B 0 RAT::P29089
Residue:
359
  
Component 2
Name:
Type-1 angiotensin II receptor A
Synonyms:
AGTRA_RAT Agtr1 Angiotensin II AT1 Angiotensin II receptor (AT-1) type-1 Type-1A angiotensin II receptor
Type:
Enzyme Catalytic Domain
Mol. Mass.:
40910.53
Organism:
RAT
Description:
ANGIOTENSIN AT1 AGTR1 RAT::P25095
Residue:
359
  
Inhibitor
Name:
BDBM50031491
Synonyms:
2-propyl-4-(methythio)-1-[[[2'-[(propylamino)carbonyl]amino]sulfonyl](1,1'-biphenyl)-4yl]methyl]-1H-imidazole-5-carboxylic acid 3-(N'-propylureidylsulfonyl-biphenyl-4-ylmethyl)-5-methylsulfanyl-2-propyl-3H-imidazole-4-carboxylic acid(S0029) | CHEMBL63998
Type:
Small organic molecule
Emp. Form.:
C25H30N4O5S2
Mol. Mass.:
530.66
SMILES:
CCCNC(=O)NS(=O)(=O)c1ccccc1-c1ccc(Cn2c(CCC)nc(SC)c2C(O)=O)cc1
: