Target
Thromboxane-A synthase
Ligand
BDBM50283042
Substrate
Meas. Tech.
ChEBML_210279
IC50
11±n/a nM
Citation
 Vlattas, IDellureficio, JCohen, DSLee, WClarke, FDotson, RMathis, JZoganas, H Thia-prostanoid analogs with combined thromboxane receptor antagonist/thromboxane synthase inhibitor activities. Synthesis and pharmacological evaluation Bioorg Med Chem Lett 4:2067-2072 (1994)    Article 
Target
Name:
Thromboxane-A synthase
Synonyms:
CYP5 Cytochrome P450 5A1 TBXAS1 TXA synthase TXS Thromboxane A2 Synthase (P450 TxA2) Thromboxane prostanoid Thromboxane-A synthase
Type:
Enzyme
Mol. Mass.:
60524.67
Organism:
Homo sapiens (Human)
Description:
P24557
Residue:
533
  
Inhibitor
Name:
BDBM50283042
Synonyms:
(Z)-7-[(2S,3S,4R)-4-(Biphenyl-4-ylmethoxy)-2-pyridin-3-yl-tetrahydro-thiophen-3-yl]-hept-4-enoic acid | CHEMBL62834
Type:
Small organic molecule
Emp. Form.:
C29H31NO3S
Mol. Mass.:
473.626
SMILES:
OC(=O)CC\C=C/CC[C@H]1[C@H](CS[C@@H]1c1cccnc1)OCc1ccc(cc1)-c1ccccc1
: