Target
Thromboxane-A synthase
Ligand
BDBM50003776
Substrate
Meas. Tech.
ChEBML_210280
IC50
2±n/a nM
Citation
 Vlattas, IDellureficio, JCohen, DSLee, WClarke, FDotson, RMathis, JZoganas, H Oxa-prostanoid analogs. Identification of an orally effective, dual thromboxane receptor antagonist /thromboxane synthase inhibitor Bioorg Med Chem Lett 4:2073-2076 (1994)    Article 
Target
Name:
Thromboxane-A synthase
Synonyms:
CYP5 Cytochrome P450 5A1 TBXAS1 TXA synthase TXS Thromboxane A2 Synthase (P450 TxA2) Thromboxane prostanoid Thromboxane-A synthase
Type:
Enzyme
Mol. Mass.:
60524.67
Organism:
Homo sapiens (Human)
Description:
P24557
Residue:
533
  
Inhibitor
Name:
BDBM50003776
Synonyms:
8-(4-Chloro-benzenesulfonylamino)-4-(3-pyridin-3-yl-propyl)-octanoic acid CHEMBL65414
Type:
Small organic molecule
Emp. Form.:
C22H29ClN2O4S
Mol. Mass.:
452.995
SMILES:
OC(=O)CCC(CCCCNS(=O)(=O)c1ccc(Cl)cc1)CCCc1cccnc1
: