Target
Leukotriene B4 receptor 1
Ligand
BDBM50029464
Substrate
Meas. Tech.
ChEMBL_98629 (CHEMBL711830)
Ki
0.470000±n/a nM
Citation
 Sawyer, JSchmittling, EABach, NJBaker, SFroelich, LLSaussy, DLMarder, PJackson, WT Structural analogues of LY292728, a highly potent xanthone dicarboxylic acid leukotriene B4 receptor antagonist: spatial positioning of the secondary acid group Bioorg Med Chem Lett 4:2077-2082 (1994)    Article 
Target
Name:
Leukotriene B4 receptor 1
Synonyms:
BLT BLTR Chemoattractant receptor-like 1 GPR16 LTB4-R 1 Leukotriene B4 R1 Leukotriene B4 receptor 1 P2Y purinoceptor 7 | P2Y7
Type:
Enzyme Catalytic Domain
Mol. Mass.:
37582.68
Organism:
Homo sapiens (Human)
Description:
Q15722
Residue:
352
  
Inhibitor
Name:
BDBM50029464
Synonyms:
5-(2-Carboxy-ethyl)-6-[3-(5-ethyl-4'-fluoro-2-hydroxy-biphenyl-4-yloxy)-propoxy]-9-oxo-9H-xanthene-2-carboxylic acid LY-292728
Type:
Small organic molecule
Emp. Form.:
C34H29FO9
Mol. Mass.:
600.5871
SMILES:
CCc1cc(c(O)cc1OCCCOc1ccc2c(oc3ccc(cc3c2=O)C(O)=O)c1CCC(O)=O)-c1ccc(F)cc1
: