Target
Type-1 angiotensin II receptor
Ligand
BDBM50049204
Substrate
Meas. Tech.
ChEMBL_36793 (CHEMBL875934)
IC50
8.1±n/a nM
Citation
 Glinka, TWde Laszlo, SESiegl, PKChang, RSKivlighn, SDSchorn, TSFaust, KAChen, TBZingaro, GJLotti, VJGreenlee, WJ Development of angiotensin II antagonists with equipotent affinity for human AT1 and AT2 receptor subtypes. Bioorg Med Chem Lett 4:2337-2342 (1994)    Article 
Target
Name:
Type-1 angiotensin II receptor
Synonyms:
AGTR1 AGTR1B AT1 AT1BR AT2R1B Angiotensin II receptor Type-1 angiotensin II receptor (AT1)
Type:
Protein
Mol. Mass.:
41080.75
Organism:
Homo sapiens (Human)
Description:
P30556
Residue:
359
  
Inhibitor
Name:
BDBM50049204
Synonyms:
2-ethyl-3-(3-fluoro-2'-(2-cyclopropylethyloxycarbonylaminosulphonyl)-biphenyl-4-ylmethyl)-6-(N-isopropyl-N-methyl-aminocarbonylamino)-3H-quinazolin-4-one CHEMBL73876 | L-163579
Type:
Small organic molecule
Emp. Form.:
C34H38FN5O6S
Mol. Mass.:
663.759
SMILES:
CCc1nc2ccc(NC(=O)N(C)C(C)C)cc2c(=O)n1Cc1ccc(cc1F)-c1ccccc1S(=O)(=O)NC(=O)OCCC1CC1
: