Target
Polyunsaturated fatty acid 5-lipoxygenase
Ligand
BDBM50283408
Substrate
Meas. Tech.
ChEBML_3954
IC50
6±n/a nM
Citation
 LeMahieu, RACarson, MHan, RJWill, PCThomas, TKNagy, CCominelli, F 4-[5-(2,3-dihydroxyphenyl)pentyloxy]-2-hydroxy-3-propylbenzoic acid (Ro 24-0553): an orally active 5-lipoxygenase inhibitor with antiinflammatory activity Bioorg Med Chem Lett 4:339-344 (1994)    Article 
Target
Name:
Polyunsaturated fatty acid 5-lipoxygenase
Synonyms:
Alox5 LOX5_RAT
Type:
PROTEIN
Mol. Mass.:
78082.31
Organism:
Rattus norvegicus
Description:
ChEMBL_1432947
Residue:
673
  
Inhibitor
Name:
BDBM50283408
Synonyms:
4-[5-(2,3-Dihydroxy-phenyl)-pentyloxy]-2-hydroxy-3-propyl-benzoic acid | CHEMBL116078
Type:
Small organic molecule
Emp. Form.:
C21H26O6
Mol. Mass.:
374.4275
SMILES:
CCCc1c(O)c(ccc1OCCCCCc1cccc(O)c1O)C(O)=O
: