Target
Voltage-dependent L-type calcium channel subunit alpha-1C
Ligand
BDBM50283421
Substrate
Meas. Tech.
ChEMBL_42914 (CHEMBL654395)
EC50
34±n/a nM
Citation
 Kane, JMCarr, AACheng, HCDudley, MWRampe, DStaeger, MA Heterocyclic guanidines as calcium antagonists Bioorg Med Chem Lett 4:351-354 (1994)    Article 
Target
Name:
Voltage-dependent L-type calcium channel subunit alpha-1C
Synonyms:
CAC1C_RAT Cacn2 Cacnl1a1 Calcium channel (Type L) Calcium channel, L type, alpha-1 polypeptide, isoform 1, cardiac muscle RBC Voltage-dependent L-type calcium channel subunit alpha-1C Voltage-gated L-type calcium channel alpha-1C subunit | Voltage-gated calcium channel subunit alpha Cav1.2
Type:
Enzyme Catalytic Domain
Mol. Mass.:
243492.26
Organism:
RAT
Description:
Calcium channel 0 RAT::P22002
Residue:
2169
  
Inhibitor
Name:
BDBM50283421
Synonyms:
((E)-Azacyclotridec-1-en-2-yl)-(2,2-diphenyl-pentyl)-amine | CHEMBL441653
Type:
Small organic molecule
Emp. Form.:
C29H42N2
Mol. Mass.:
418.6572
SMILES:
CCCC(CNC1=NCCCCCCCCCCC1)(c1ccccc1)c1ccccc1
: