Target
Stromelysin-1
Ligand
BDBM50283700
Substrate
Meas. Tech.
ChEBML_102088
Ki
127±n/a nM
Citation
 Porter, JRBeeley, NRBoyce, BAMason, BMillican, AMillar, KLeonard, JMorphy, JRO'Connell, JP Potent and selective inhibitors of gelatinase-a 1. hydroxamic acid derivatives Bioorg Med Chem Lett 4:2741-2746 (1994)    Article 
Target
Name:
Stromelysin-1
Synonyms:
MMP-3 MMP3_HUMAN Matrix metalloproteinase 3 Matrix metalloproteinase-3 (MMP-3) SL-1 Stromelysin 1 | Transin-1
Type:
Enzyme
Mol. Mass.:
53973.13
Organism:
Homo sapiens (Human)
Description:
P08254
Residue:
477
  
Inhibitor
Name:
BDBM50283700
Synonyms:
(R)-N*1*-[(S)-1-((S)-1-Carbamoyl-2-phenyl-ethylcarbamoyl)-3-methyl-butyl]-N*4*-hydroxy-2-isobutyl-succinamide | CHEMBL93890
Type:
Small organic molecule
Emp. Form.:
C23H36N4O5
Mol. Mass.:
448.5557
SMILES:
CC(C)C[C@H](CC(=O)NO)C(=O)N[C@@H](CC(C)C)C(=O)N[C@@H](Cc1ccccc1)C(N)=O
: