Target
D(3) dopamine receptor
Ligand
BDBM50041959
Substrate
Meas. Tech.
ChEMBL_58786 (CHEMBL666973)
Ki
26±n/a nM
Citation
 Haadsma-Svensson, SRSmith, MWLin, CHDuncan, JNSonesson, CWikström, HWaters, NCarlsson, ASvensson, K Synthesis and biological activity of C-5 modified derivatives of (+)-AJ76 and (+)-UH232: Increased dopamine D3 receptor preference and improved pharmacokinetic properties Bioorg Med Chem Lett 4:689-694 (1994)    Article 
Target
Name:
D(3) dopamine receptor
Synonyms:
DOPAMINE D3 DRD3_HUMAN Dopamine D3 receptor (D3) Dopamine receptor Dopamine receptor D3
Type:
Mol. Mass.:
44243.43
Organism:
Homo sapiens (Human)
Description:
Residue:
400
  
Inhibitor
Name:
BDBM50041959
Synonyms:
((1S,2R)-5-Methoxy-1-methyl-1,2,3,4-tetrahydro-naphthalen-2-yl)-propyl-amine (1S,2R)-(5-Methoxy-1-methyl-1,2,3,4-tetrahydro-naphthalen-2-yl)-propyl-amine AJ76(+) | CHEMBL27441
Type:
Small organic molecule
Emp. Form.:
C15H23NO
Mol. Mass.:
233.3492
SMILES:
CCCN[C@@H]1CCc2c(OC)cccc2[C@@H]1C
: