Target
Endothelin-1 receptor
Ligand
BDBM50284283
Substrate
Meas. Tech.
ChEMBL_63376 (CHEMBL878288)
IC50
8.89E6±n/a nM
Citation
 Hasegawa, KHirata, MKoshi, TOhshima, TMiyashita, YSasaki, SiOkabe, T Quantitative structure-activity relationships study of endothelin-1 analogs Bioorg Med Chem Lett 4:1157-1160 (1994)    Article 
Target
Name:
Endothelin-1 receptor
Synonyms:
EDNRA_RAT Ednra Endothelin-1 receptor
Type:
Enzyme Catalytic Domain
Mol. Mass.:
48256.91
Organism:
RAT
Description:
ENDOTHELIN A EDNRA RAT::P26684
Residue:
426
  
Inhibitor
Name:
BDBM50284283
Synonyms:
CHEMBL439489 | Endothelin-1 analogue
Type:
Small organic molecule
Emp. Form.:
C111H159N25O32S5
Mol. Mass.:
2515.923
SMILES:
CC[C@@H](C)[C@H](NC(=O)[C@H](CC(O)=O)NC(=O)[C@H](CC(C)C)NC(=O)[C@H](Cc1cnc[nH]1)NC(=O)[C@H](CS)NC(=O)[C@H](Cc1ccccc1)NC(=O)[C@H](Cc1ccc(O)cc1)NC(=O)[C@@H](NC(=O)[C@H](CS)NC(=O)[C@H](CCC(O)=O)NC(=O)[C@H](CCCCN)NC(=O)[C@H](CC(O)=O)NC(=O)[C@H](CCSC)NC(=O)[C@H](CC(C)C)NC(=O)[C@H](CO)NC(=O)[C@H](CO)NC(=O)[C@H](CS)NC(=O)[C@H](CO)NC(=O)[C@@H](N)CS)C(C)C)C(=O)N[C@H](C(=O)N[C@@H](Cc1c[nH]c2ccccc12)C(O)=O)c1ccccc1
: