Target
Sodium-dependent serotonin transporter
Ligand
BDBM50285314
Substrate
Meas. Tech.
ChEMBL_201503 (CHEMBL805631)
IC50
12.42±n/a nM
Citation
 LeBoulluec, KLMattson, RJMahle, CDMcGovern, RTNowak, HPGentile, AJ Bivalent indoles exhibiting serotonergic binding affinity Bioorg Med Chem Lett 5:123-126 (1995)    Article 
Target
Name:
Sodium-dependent serotonin transporter
Synonyms:
5-HT Transporter 5HT transporter Anandamid membrane transporter, AMT Monoamine transporters; Norepinephrine & serotonin Slc6a4 Sodium-dependent serotonin transporter (SERT) | imipramine receptor
Type:
Multi-pass membrane protein
Mol. Mass.:
70168.43
Organism:
Rattus norvegicus (rat)
Description:
P31652
Residue:
630
  
Inhibitor
Name:
BDBM50285314
Synonyms:
3-(4-{8-[4-(5-carbamoyl-1H-3-indolyl)-3-cyclohexenylamino]octylamino}-1-cyclohexenyl)-1H-5-indolecarboxamide | CHEMBL22961
Type:
Small organic molecule
Emp. Form.:
C38H48N6O2
Mol. Mass.:
620.8267
SMILES:
NC(=O)c1ccc2[nH]cc(C3=CCC(CC3)NCCCCCCCCNC3CCC(=CC3)c3c[nH]c4ccc(cc34)C(N)=O)c2c1
: