Target
Sterol O-acyltransferase 1
Ligand
BDBM50051901
Substrate
Meas. Tech.
ChEBML_28488
IC50
30±n/a nM
Citation
 Wilde, RGKlaczkiewicz, JDBillheimer, JTWexler, RRGillies, PJ Acyl CoA:cholesterol acyltransferase (ACAT) inhibitors: heterocyclic bioisosteres for the urea group in DuP 128 Bioorg Med Chem Lett 5:177-180 (1995)    Article 
Target
Name:
Sterol O-acyltransferase 1
Synonyms:
ACAT-1 Acat SOAT1_RAT Sterol O-acyltransferase, Soat
Type:
PROTEIN
Mol. Mass.:
64165.56
Organism:
Rattus norvegicus
Description:
ChEMBL_28796
Residue:
545
  
Inhibitor
Name:
BDBM50051901
Synonyms:
1-[5-(4,5-Diphenyl-1H-imidazol-2-ylsulfanyl)-pentyl]-3,5-dimethyl-1H-pyrazole | CHEMBL33780
Type:
Small organic molecule
Emp. Form.:
C25H28N4S
Mol. Mass.:
416.582
SMILES:
Cc1cc(C)n(CCCCCSc2nc(c([nH]2)-c2ccccc2)-c2ccccc2)n1
: