Target
72 kDa type IV collagenase
Ligand
BDBM50285559
Substrate
Meas. Tech.
ChEBML_101914
Ki
11±n/a nM
Citation
 Sahoo, SPCaldwell, CGChapman, KTDurette, PLEsser, CKKopka, IEPolo, SASperow, KMNiedzwiecki, LMIzquierdo-Martin, MChang, BCHarrison, RKStein, RLMacCoss, MHagmann, WK Inhibition of matrix metalloproteinases by N-carboxyalkyl dipeptides: Enhanced potency and selectivity with substituted P1′ homophenylalanines Bioorg Med Chem Lett 5:2441-2446 (1995)    Article 
Target
Name:
72 kDa type IV collagenase
Synonyms:
72 kDa gelatinase CLG4A Gelatinase A (MMP-2) MMP2_HUMAN Matrix metalloproteinase-2 (MMP 2) Matrix metalloproteinases 2 (MMP-2) | TBE-1
Type:
Enzyme
Mol. Mass.:
73870.36
Organism:
Homo sapiens (Human)
Description:
P08253
Residue:
660
  
Inhibitor
Name:
BDBM50285559
Synonyms:
(R)-2-((S)-4-(4-isobutylphenyl)-1-((S)-4-methyl-1-oxo-1-(phenylamino)pentan-2-ylamino)-1-oxobutan-2-ylamino)propanoic acid CHEMBL81270
Type:
Small organic molecule
Emp. Form.:
C29H41N3O4
Mol. Mass.:
495.6535
SMILES:
CC(C)C[C@H](NC(=O)[C@H](CCc1ccc(CC(C)C)cc1)N[C@H](C)C(O)=O)C(=O)Nc1ccccc1
: