Target
Type-2 angiotensin II receptor
Ligand
BDBM50406795
Substrate
Meas. Tech.
ChEBML_35407
IC50
>10000±n/a nM
Citation
 Mederski, WWDorsch, DOsswald, MBeier, NLues, IMinck, KOSchelling, PLadstetter, BJ 4,5-Dihydro-4-oxo-3H-imidazo[4,5-c]pyridines: potent arylacetic acid-derived AT1 antagonists with improved affinity for the AT2 receptor Bioorg Med Chem Lett 5:2665-2670 (1995)    Article 
Target
Name:
Type-2 angiotensin II receptor
Synonyms:
AGTR2_RAT Agtr2 Angiotensin II receptor Type-2 angiotensin II receptor
Type:
Enzyme Catalytic Domain
Mol. Mass.:
41346.62
Organism:
RAT
Description:
Angiotensin II AT2 0 0::P35351
Residue:
363
  
Inhibitor
Name:
BDBM50406795
Synonyms:
Cozaar | LOSARTAN POTASSIUM
Type:
Small organic molecule
Emp. Form.:
C22H22ClN6O
Mol. Mass.:
421.903
SMILES:
CCCCc1nc(Cl)c(CO)n1Cc1ccc(cc1)-c1ccccc1-c1nn[n-]n1
: