Target
Sterol O-acyltransferase 1
Ligand
BDBM50450388
Substrate
Meas. Tech.
ChEBML_28483
IC50
810±n/a nM
Citation
 O'Brien, PMSliskovic, DRAnderson, MKBousley, RFKrause, BRStanfield, RL Inhibitors of acyl-CoA: Cholesterol O-acyl transferase (ACAT) as hypocholesterolemic agents. 12. Syntheses and biological activity of structurally novel tetrazole amides Bioorg Med Chem Lett 5:289-294 (1995)    Article 
Target
Name:
Sterol O-acyltransferase 1
Synonyms:
ACAT-1 Acat SOAT1_RAT Sterol O-acyltransferase, Soat
Type:
PROTEIN
Mol. Mass.:
64165.56
Organism:
Rattus norvegicus
Description:
ChEMBL_28796
Residue:
545
  
Inhibitor
Name:
BDBM50450388
Synonyms:
CHEMBL321102
Type:
Small organic molecule
Emp. Form.:
C33H49N5O
Mol. Mass.:
531.7751
SMILES:
CCCCCCCCCCCCn1nnc(n1)C(NC(=O)c1c(cccc1C(C)C)C(C)C)c1ccccc1
: