Target
Potassium-transporting ATPase alpha chain 2
Ligand
BDBM50286741
Substrate
Meas. Tech.
ChEBML_144115
IC50
25000±n/a nM
Citation
 Haruna, MTanaka, MSugimoto, TKojima, RSuzuki, YKonoshima, TKozuka, MIto, K Alteration of Na+ permeability in human erythrocytes as studied by 23Na-NMR and inhibition of the kidney Na+,K+-ATPase activities with saponins: Interaction of Gleditsia saponins with human erythrocyte membranes Bioorg Med Chem Lett 5:827-830 (1995)    Article 
Target
Name:
Potassium-transporting ATPase alpha chain 2
Synonyms:
AT12A_HUMAN ATP1AL1
Type:
PROTEIN
Mol. Mass.:
115509.17
Organism:
Homo sapiens (Human)
Description:
ChEMBL_144101
Residue:
1039
  
Inhibitor
Name:
BDBM50286741
Synonyms:
CHEMBL168713 | methyl 18-[6-(2-{2-[4,5-dihydroxy-3-(3,4,5-trihydroxytetrahydro-2H-2-pyranyloxy)tetrahydro-2H-2-pyranyl]ethoxy}ethyl)-3,4,5-trihydroxytetrahydro-2H-2-pyranyloxy]-4-hydroxy-1,2,8,8,15,19,19-heptamethylpentacyclo[12.8.0.02,11.05,10.015,20]
Type:
Small organic molecule
Emp. Form.:
C50H82O17
Mol. Mass.:
955.1759
SMILES:
COC(=O)C12CCC(C)(C)CC1C1=CCC3[C@@]4(C)CCC(OC5OC(CCOCCC6OCC(O)C(O)C6OC6OCC(O)C(O)C6O)C(O)C(O)C5O)C(C)(C)C4CC[C@@]3(C)[C@]1(C)C[C@H]2O
: