Target
Prostaglandin G/H synthase 1
Ligand
BDBM50029593
Substrate
Meas. Tech.
ChEMBL_51674 (CHEMBL664167)
IC50
>100000±n/a nM
Citation
 Reitz, DBHuang, HCLi, JJGarland, DJManning, REAnderson, GDGregory, SAKoboldt, CMPerkins, WESeibert, KIsakson, PC Selective cyclooxygenase inhibitors: Novel 4-spiro 1,2-diarylcyclopentenes are potent and orally active cox-2 inhibitors Bioorg Med Chem Lett 5:867-872 (1995)    Article 
Target
Name:
Prostaglandin G/H synthase 1
Synonyms:
COX-1 Cyclooxygenase Cyclooxygenase-1 (COX-1) PTGS1 | Prostaglandin G/H synthase (cyclooxygenase)
Type:
Enzyme
Mol. Mass.:
68692.62
Organism:
Homo sapiens (Human)
Description:
P23219
Residue:
599
  
Inhibitor
Name:
BDBM50029593
Synonyms:
CHEMBL7162 N-(2-Cyclohexyloxy-4-nitro-phenyl)-methanesulfonamide N-[2-(cyclohexyloxy)-4-nitrophenyl]methane sulfonamide N-{2-(cyclohexyloxy)-4-[hydroxy(oxido)amino]phenyl}methanesulfonamide NS398
Type:
Small organic molecule
Emp. Form.:
C13H18N2O5S
Mol. Mass.:
314.357
SMILES:
CS(=O)(=O)Nc1ccc(cc1OC1CCCCC1)[N+]([O-])=O
: