Target
Acyl-CoA:cholesterol acyltransferase
Ligand
BDBM50051901
Substrate
Meas. Tech.
ChEMBL_28176 (CHEMBL638582)
IC50
108±n/a nM
Citation
 Smith, CAshton, MJBush, RCFacchini, VHarris, NVHart, TWJordan, RMacKenzie, RRiddell, D RP 73163: A bioavailable alkylsulphinyl-diphenylimidazole ACAT inhibitor Bioorg Med Chem Lett 6:47-50 (1996)    Article 
Target
Name:
Acyl-CoA:cholesterol acyltransferase
Synonyms:
ACAT
Type:
Mol. Mass.:
35405.31
Organism:
Oryctolagus cuniculus
Description:
Residue:
305
  
Inhibitor
Name:
BDBM50051901
Synonyms:
1-[5-(4,5-Diphenyl-1H-imidazol-2-ylsulfanyl)-pentyl]-3,5-dimethyl-1H-pyrazole | CHEMBL33780
Type:
Small organic molecule
Emp. Form.:
C25H28N4S
Mol. Mass.:
416.582
SMILES:
Cc1cc(C)n(CCCCCSc2nc(c([nH]2)-c2ccccc2)-c2ccccc2)n1
: