Target
Gastrin/cholecystokinin type B receptor
Ligand
BDBM50056101
Substrate
Meas. Tech.
ChEBML_48442
IC50
0.110000±n/a nM
Citation
 Semple, GRyder, HKendrick, DASzelke, MOhta, MSatoh, MNishida, AAkuzawa, SMiyata, K Synthesis and biological activity of 1-alkylcarbonylmethyl analogues of YM022 Bioorg Med Chem Lett 6:51-54 (1996)    Article 
Target
Name:
Gastrin/cholecystokinin type B receptor
Synonyms:
Cckbr Cholecystokinin B receptor GASR_RAT | Gastrin/cholecystokinin type B receptor
Type:
Enzyme Catalytic Domain
Mol. Mass.:
48980.43
Organism:
RAT
Description:
Cholecystokinin A CCKBR RAT::P30553
Residue:
452
  
Inhibitor
Name:
BDBM50056101
Synonyms:
1-[(R)-2-Oxo-1-(2-oxo-2-o-tolyl-ethyl)-5-phenyl-2,3-dihydro-1H-benzo[e][1,4]diazepin-3-yl]-3-m-tolyl-urea YM022 | YM022 Racemate
Type:
Small organic molecule
Emp. Form.:
C32H28N4O3
Mol. Mass.:
516.5897
SMILES:
Cc1cccc(NC(=O)N[C@@H]2N=C(c3ccccc3)c3ccccc3N(CC(=O)c3ccccc3C)C2=O)c1
: