Target
Gastrin/cholecystokinin type B receptor
Ligand
BDBM50286903
Substrate
Meas. Tech.
ChEBML_48441
IC50
0.120000±n/a nM
Citation
 Semple, GRyder, HKendrick, DASzelke, MOhta, MSatoh, MNishida, AAkuzawa, SMiyata, K Synthesis and biological activity of 5-heteroaryl benzodiazepines: analogues of YM022 Bioorg Med Chem Lett 6:55-58 (1996)    Article 
Target
Name:
Gastrin/cholecystokinin type B receptor
Synonyms:
Cckbr Cholecystokinin B receptor GASR_RAT | Gastrin/cholecystokinin type B receptor
Type:
Enzyme Catalytic Domain
Mol. Mass.:
48980.43
Organism:
RAT
Description:
Cholecystokinin A CCKBR RAT::P30553
Residue:
452
  
Inhibitor
Name:
BDBM50286903
Synonyms:
1-[1-(2-Cyclopentyl-2-oxo-ethyl)-2-oxo-5-pyridin-2-yl-2,3-dihydro-1H-benzo[e][1,4]diazepin-3-yl]-3-m-tolyl-urea | CHEMBL351144
Type:
Small organic molecule
Emp. Form.:
C29H29N5O3
Mol. Mass.:
495.5723
SMILES:
Cc1cccc(NC(=O)NC2N=C(c3ccccn3)c3ccccc3N(CC(=O)C3CCCC3)C2=O)c1
: