Target
Gastrin/cholecystokinin type B receptor
Ligand
BDBM50286904
Substrate
Meas. Tech.
ChEBML_48441
IC50
0.880000±n/a nM
Citation
 Semple, GRyder, HKendrick, DASzelke, MOhta, MSatoh, MNishida, AAkuzawa, SMiyata, K Synthesis and biological activity of 5-heteroaryl benzodiazepines: analogues of YM022 Bioorg Med Chem Lett 6:55-58 (1996)    Article 
Target
Name:
Gastrin/cholecystokinin type B receptor
Synonyms:
Cckbr Cholecystokinin B receptor GASR_RAT | Gastrin/cholecystokinin type B receptor
Type:
Enzyme Catalytic Domain
Mol. Mass.:
48980.43
Organism:
RAT
Description:
Cholecystokinin A CCKBR RAT::P30553
Residue:
452
  
Inhibitor
Name:
BDBM50286904
Synonyms:
1-[1-(3,3-Dimethyl-2-oxo-butyl)-2-oxo-5-pyrazin-2-yl-2,3-dihydro-1H-benzo[e][1,4]diazepin-3-yl]-3-m-tolyl-urea | CHEMBL156484
Type:
Small organic molecule
Emp. Form.:
C27H28N6O3
Mol. Mass.:
484.5496
SMILES:
Cc1cccc(NC(=O)NC2N=C(c3cnccn3)c3ccccc3N(CC(=O)C(C)(C)C)C2=O)c1
: