Target
Cholesteryl ester transfer protein
Ligand
BDBM50287674
Substrate
Meas. Tech.
ChEBML_48940
IC50
24000±n/a nM
Citation
 Pietzonka, TDamon, RRussell, MWattanasin, S Phosphonate-containing analogs of cholesteryl ester as novel inhibitors of cholesteryl ester transfer protein Bioorg Med Chem Lett 6:1951-1954 (1996)    Article 
Target
Name:
Cholesteryl ester transfer protein
Synonyms:
CETP Cholesteryl ester transfer protein (CETP) | Lipid transfer protein I
Type:
Enzyme
Mol. Mass.:
54751.53
Organism:
Homo sapiens (Human)
Description:
P11597
Residue:
493
  
Inhibitor
Name:
BDBM50287674
Synonyms:
CHEMBL57042 | Tetradecyl-phosphonic acid mono-naphthalen-2-yl ester
Type:
Small organic molecule
Emp. Form.:
C24H37O3P
Mol. Mass.:
404.5225
SMILES:
CCCCCCCCCCCCCCP(O)(=O)Oc1ccc2ccccc2c1
: