Target
Cathepsin D
Ligand
BDBM50287743
Substrate
Meas. Tech.
ChEBML_45186
IC50
780±n/a nM
Citation
 Whitesitt, CASimon, RLReel, JKSigmund, SKPhillips, MLShadle, JKHeinz, LJKoppel, GAHunden, DCLifer, SLBerry, DRay, JLittle, SPLiu, XMarshall, WSPanetta, JA Synthesis and structure-activity relationships of benzophenones as inhibitors of cathepsin D Bioorg Med Chem Lett 6:2157-2162 (1996)    Article 
Target
Name:
Cathepsin D
Synonyms:
CATD_HUMAN CTSD Cathepsin D heavy chain Cathepsin D precursor
Type:
Enzyme
Mol. Mass.:
44551.72
Organism:
Homo sapiens (Human)
Description:
Human proCathepsin D (SwissProt accession number P07339) was expressed in Sf9 cells, purified, and autoactivated.
Residue:
412
  
Inhibitor
Name:
BDBM50287743
Synonyms:
5-[1-[4-(4-Benzoyl-phenoxymethyl)-phenyl]-meth-(Z)-ylidene]-2-thioxo-thiazolidin-4-one | CHEMBL68538
Type:
Small organic molecule
Emp. Form.:
C24H17NO3S2
Mol. Mass.:
431.527
SMILES:
SC1=NC(=O)C(S1)=Cc1ccc(COc2ccc(cc2)C(=O)c2ccccc2)cc1
: