Target
Integrin alpha-IIb/beta-3
Ligand
BDBM50288115
Substrate
Meas. Tech.
ChEMBL_218205 (CHEMBL824554)
Ki
1.5±n/a nM
Citation
 Miller, WHAli, FEBondinell, WECallahan, JFCalvo, RREggleston, DSHaltiwanger, RCHuffman, WFHwang, SMJakas, DRKeenan, RMKoster, PFKu, TWKwon, CNewlander, KANichols, AJParker, MFSamanen, JMSouthall, LSTakata, DT Structure-activity relationships in 3-oxo-1,4-benzodiazepine-2-acetic acid GPIIb/IIIa antagonists. The 2-benzazepine series Bioorg Med Chem Lett 6:2481-2486 (1996)    Article 
Target
Name:
Integrin alpha-IIb/beta-3
Synonyms:
Glycoprotein IIb/IIIa
Type:
Mol. Mass.:
Description:
ASSAY_ID of EBI is 30109
Components:
This complex has 2 components.
Component 1
Name:
Integrin beta-3
Synonyms:
CD_antigen=CD61 GPIIIa ITGB3 Platelet membrane glycoprotein IIIa
Type:
Protein
Mol. Mass.:
87038.91
Organism:
Homo sapiens (Human)
Description:
P05106
Residue:
788
  
Component 2
Name:
Integrin alpha-IIb
Synonyms:
CD_antigen=CD41 GPIIb Glycoprotein IIb ITGA2B Integrin alpha-IIb heavy chain Integrin alpha-IIb light chain, form 2 Integrin alpha-V/beta-3 and alpha-IIb/beta 3 | Platelet membrane glycoprotein IIb
Type:
Protein
Mol. Mass.:
113354.85
Organism:
Homo sapiens (Human)
Description:
P08514
Residue:
1039
  
Inhibitor
Name:
BDBM50288115
Synonyms:
CHEMBL82746 | {2-(3-Methyl-butyl)-7-[methyl-(2-piperidin-4-yl-ethyl)-carbamoyl]-3-oxo-2,3,4,5-tetrahydro-1H-benzo[c]azepin-4-yl}-acetic acid
Type:
Small organic molecule
Emp. Form.:
C26H39N3O4
Mol. Mass.:
457.6056
SMILES:
CC(C)CCN1Cc2ccc(cc2CC(CC(O)=O)C1=O)C(=O)N(C)CCC1CCNCC1
: