Target
5-hydroxytryptamine receptor 3A
Ligand
BDBM50000492
Substrate
Meas. Tech.
ChEMBL_3401 (CHEMBL619647)
Kd
0.600000±n/a nM
Citation
 Paulis, TdTrivedi, BLZhang, ZJSchmidt, DEEbert, MHHewlett, WA (S)-4-amino-5-chloro-3-iodo-2-methoxy-N-(1-azabicyclo[2.2.2]oct-3-yl)benzamide (TRIZAC), a high-affinity ligand for the 5-HT-3 receptor Bioorg Med Chem Lett 6:2657-2662 (1996)    Article 
Target
Name:
5-hydroxytryptamine receptor 3A
Synonyms:
5-HT3 5HT3A_RAT Htr3 Serotonin (5-HT) receptor | Zacopride site-R
Type:
Enzyme Catalytic Domain
Mol. Mass.:
55428.70
Organism:
RAT
Description:
5-HT3 HTR3A RAT::P35563
Residue:
483
  
Inhibitor
Name:
BDBM50000492
Synonyms:
(zacopride)4-Amino-N-(1-aza-bicyclo[2.2.2]oct-3-yl)-5-chloro-2-methoxy-benzamide 4-Amino-N-(1-aza-bicyclo[2.2.2]oct-3-yl)-5-chloro-2-methoxy-benzamide (Zacopride) CHEMBL18041 ZACOPRIDE ZACOPRIDE,RS | ZACOPRIDE,S
Type:
Small organic molecule
Emp. Form.:
C15H20ClN3O2
Mol. Mass.:
309.791
SMILES:
COc1cc(N)c(Cl)cc1C(=O)NC1CN2CCC1CC2
: