Target
Prothrombin
Ligand
BDBM50288406
Substrate
Meas. Tech.
ChEBML_208357
Ki
0.041000±n/a nM
Citation
 Galemmo, RAFevig, JMCarini, DJCacciola, JWells, BLHillyer, GLJr., JBRossi, KAStouten, PFAlexander, RSHilmer, RBostrom, LAbelman, MMLee, SLWeber, PCKettner, CAKnabb, RMWexler, RR (N-acyl-N-alkyl)glycyl borolysine analogs: A new class of potent thrombin inhibitors Bioorg Med Chem Lett 6:2913-2918 (1996)    Article 
Target
Name:
Prothrombin
Synonyms:
Activation peptide fragment 1 Coagulation factor II Prothrombin precursor Thrombin heavy chain | Thrombin light chain
Type:
Protein
Mol. Mass.:
70029.57
Organism:
Homo sapiens (Human)
Description:
P00734
Residue:
622
  
Inhibitor
Name:
BDBM50288406
Synonyms:
1-(2-Acetylamino-3-phenyl-propionyl)-pyrrolidine-2-carboxylic acid (1-dihydroxyboranyl-4-guanidino-butyl)-amide CHEMBL290376
Type:
Small organic molecule
Emp. Form.:
C21H33BN6O5
Mol. Mass.:
460.335
SMILES:
CC(=O)N[C@H](Cc1ccccc1)C(=O)N1CCC[C@H]1C(=O)N[C@@H](CCCNC(N)=N)B(O)O
: