Target
Chymotrypsin-like elastase family member 2A
Ligand
BDBM50036479
Substrate
Meas. Tech.
ChEBML_158078
Ki
62±n/a nM
KON
240 M-1s-1
Citation
 Hlasta, DJCourt, JJDesai, RCTalomie, TGShen, JDunlap, RPand, CAMura, AJ A comparative SAR and computer modeling study of benzisothiazolone, mechanism-based inhibitors with porcine pancreatic and human leukocyte elastase Bioorg Med Chem Lett 6:2941-2946 (1996)    Article 
Target
Name:
Chymotrypsin-like elastase family member 2A
Synonyms:
CEL2A_PIG ELA2 Elastase 2A Elastase-2A | Pancreatic elastase
Type:
PROTEIN
Mol. Mass.:
28705.23
Organism:
Sus scrofa
Description:
ChEMBL_156951
Residue:
269
  
Inhibitor
Name:
BDBM50036479
Synonyms:
1,1-Dioxo-2-(1-phenyl-1H-tetrazol-5-ylsulfanylmethyl)-1,2-dihydro-1lambda*6*-benzo[d]isothiazol-3-one | CHEMBL50803
Type:
Small organic molecule
Emp. Form.:
C15H11N5O3S2
Mol. Mass.:
373.41
SMILES:
O=C1N(CSc2nnnn2-c2ccccc2)S(=O)(=O)c2ccccc12
: