Target
Stromelysin-1
Ligand
BDBM50288678
Substrate
Meas. Tech.
ChEBML_102081
Ki
5.5±n/a nM
Citation
 Caldwell, CGSahoo, SPPolo, SAEversole, RRLanza, TJMills, SGNiedzwiecki, LMIzquierdo-Martin, MChang, BCHarrison, RKKuo, DWLin, TYStein, RLDurette, PLHagmann, WK Phosphinic acid inhibitors of matrix metalloproteinases Bioorg Med Chem Lett 6:323-328 (1996)    Article 
Target
Name:
Stromelysin-1
Synonyms:
MMP-3 MMP3_HUMAN Matrix metalloproteinase 3 Matrix metalloproteinase-3 (MMP-3) SL-1 Stromelysin 1 | Transin-1
Type:
Enzyme
Mol. Mass.:
53973.13
Organism:
Homo sapiens (Human)
Description:
P08254
Residue:
477
  
Inhibitor
Name:
BDBM50288678
Synonyms:
CHEMBL320968 | [(S)-2-((S)-3-Methyl-1-phenylcarbamoyl-butylcarbamoyl)-4-phenyl-butyl]-[4-(1-oxo-1,3-dihydro-isoindol-2-yl)-butyl]-phosphinic acid
Type:
Small organic molecule
Emp. Form.:
C35H44N3O5P
Mol. Mass.:
617.7147
SMILES:
CC(C)C[C@H](NC(=O)[C@H](CCc1ccccc1)CP(O)(=O)CCCCN1Cc2ccccc2C1=O)C(=O)Nc1ccccc1
: