Target
72 kDa type IV collagenase
Ligand
BDBM50288668
Substrate
Meas. Tech.
ChEMBL_101916 (CHEMBL710546)
Ki
19±n/a nM
Citation
 Caldwell, CGSahoo, SPPolo, SAEversole, RRLanza, TJMills, SGNiedzwiecki, LMIzquierdo-Martin, MChang, BCHarrison, RKKuo, DWLin, TYStein, RLDurette, PLHagmann, WK Phosphinic acid inhibitors of matrix metalloproteinases Bioorg Med Chem Lett 6:323-328 (1996)    Article 
Target
Name:
72 kDa type IV collagenase
Synonyms:
72 kDa gelatinase CLG4A Gelatinase A (MMP-2) MMP2_HUMAN Matrix metalloproteinase-2 (MMP 2) Matrix metalloproteinases 2 (MMP-2) | TBE-1
Type:
Enzyme
Mol. Mass.:
73870.36
Organism:
Homo sapiens (Human)
Description:
P08253
Residue:
660
  
Inhibitor
Name:
BDBM50288668
Synonyms:
CHEMBL109829 | [4-(3-Ethyl-ureido)-butyl]-[(S)-2-((S)-3-methyl-1-phenylcarbamoyl-butylcarbamoyl)-4-phenyl-butyl]-phosphinic acid
Type:
Small organic molecule
Emp. Form.:
C30H45N4O5P
Mol. Mass.:
572.6759
SMILES:
CCNC(=O)NCCCCP(O)(=O)C[C@@H](CCc1ccccc1)C(=O)N[C@@H](CC(C)C)C(=O)Nc1ccccc1
: