Target
Lysosomal alpha-glucosidase
Ligand
BDBM50288852
Substrate
Meas. Tech.
ChEBML_216948
IC50
>1000000±n/a nM
Citation
 Igarashi, YIchikawa, MIchikawa, Y Synthesis of a new inhibitor of α-fucosidase Bioorg Med Chem Lett 6:553-558 (1996)    Article 
Target
Name:
Lysosomal alpha-glucosidase
Synonyms:
70 kDa lysosomal alpha-glucosidase Acid maltase Alpha glucosidase LYAG_HUMAN
Type:
PROTEIN
Mol. Mass.:
105312.45
Organism:
Homo sapiens (Human)
Description:
ChEMBL_1506060
Residue:
952
  
Inhibitor
Name:
BDBM50288852
Synonyms:
5-Methoxy-piperidine-3,4-diol | CHEMBL414447
Type:
Small organic molecule
Emp. Form.:
C6H13NO3
Mol. Mass.:
147.1723
SMILES:
COC1CNCC(O)C1O
: