Target
Tissue alpha-L-fucosidase
Ligand
BDBM50104412
Substrate
Meas. Tech.
ChEMBL_216813 (CHEMBL816392)
IC50
26000±n/a nM
Citation
 Igarashi, YIchikawa, MIchikawa, Y Synthesis of a new inhibitor of α-fucosidase Bioorg Med Chem Lett 6:553-558 (1996)    Article 
Target
Name:
Tissue alpha-L-fucosidase
Synonyms:
Alpha-L-fucosidase I FUCA1 Tissue alpha-L-fucosidase
Type:
PROTEIN
Mol. Mass.:
53690.69
Organism:
Homo sapiens (Human)
Description:
ChEMBL_34088
Residue:
466
  
Inhibitor
Name:
BDBM50104412
Synonyms:
(S)-5-Methyl-piperidine-3,4-diol | CHEMBL86305
Type:
Small organic molecule
Emp. Form.:
C6H13NO2
Mol. Mass.:
131.1729
SMILES:
CC1CNC[C@H](O)C1O
: