Target
Tissue alpha-L-fucosidase
Ligand
BDBM50288853
Substrate
Meas. Tech.
ChEBML_216813
IC50
270000±n/a nM
Citation
 Igarashi, YIchikawa, MIchikawa, Y Synthesis of a new inhibitor of α-fucosidase Bioorg Med Chem Lett 6:553-558 (1996)    Article 
Target
Name:
Tissue alpha-L-fucosidase
Synonyms:
Alpha-L-fucosidase I FUCA1 Tissue alpha-L-fucosidase
Type:
PROTEIN
Mol. Mass.:
53690.69
Organism:
Homo sapiens (Human)
Description:
ChEMBL_34088
Residue:
466
  
Inhibitor
Name:
BDBM50288853
Synonyms:
1-Butyl-5-methyl-piperidine-3,4-diol | CHEMBL356023
Type:
Small organic molecule
Emp. Form.:
C10H21NO2
Mol. Mass.:
187.2792
SMILES:
CCCCN1CC(C)C(O)C(O)C1
: